errors
Discussion List
-
Error collecting information about available definitions
I am trying to write unit tests for a STM32CubeIDE project. I have build the .bdf file and imported it to Parasoft C/C++Test (Standalone). I was able to generate some unit tests, however if I try to run the unit tests or collect stub information I get the following error: "C/C++test analysis errors in /project_folder 1.…
-
Test execution: error preparing instrumentation / symbols data for file upon including glib header
**Test execution: error preparing instrumentation / symbols data for file. "/usr/include/glib-2.0/glib/gspawn.h", line 76: error: expected a "}" G_SPAWN_ERROR_2BIG __attribute__((__deprecated__("Use '" "G_SPAWN_ERROR_TOO_BIG" "' instead"))) = G_SPAWN_ERROR_TOO_BIG, ^* Test execution of my code fails in parasoft tool…
-
Why do I get Resource "my resource" is out of sync with file system.
Why do I get the meesage "Resource 'my resource' is out of sync with file system? What is the fastest and easiest way to alleviate the problem?
-
Generating a Log (Technical Support Archive) to Troubleshoot Errors/Failures
Parasoft: Generating a Log (Technical Support Archive) to troubleshoot Failures/Errors Description: Initially, if a user is experiencing unexpected behavior such as build failures, warnings, or errors, the user should look over the console output, the Quality Task notifications, or the Error view to determine the reason…
-
fatal: librt.so.1: version `SUNW_1.2' not found?
How do I fix this?When I try to run Jtest on Solaris 8 I get this message: CODEError: tgsutil not loaded java.lang.UnsatisfiedLinkError: /devel/home/parasoft/jtest5/plugins/com.parasoft ..eclipse.api.solaris_5.1.51/jtest/lib/libtgsutil.so: ld.so.1:…
Popular Tags
- SOAtest 454
- legacy 440
- Virtualize 207
- C/C++test 179
- scripting 106
- .parasoft 82
- unit testing 64
- Parasoft Virtualize 61
- Announcement 61
- static analysis 58
- jtest 57
- dotTEST 48
- assertions 47
- C++ test 43
- API Testing 39
- cli 38
- automation 37
- data source 37
- xpath 35
- java 33
- reporting 33
- LoadTest 32
- SOAtest Virtualize 32
- ctp 30
- JSON 29